Reaction Details
TargetProstaglandin G/H synthase 2
LigandBDBM50057573
Substrate/Competitorn/a
Meas. Tech.ChEMBL_157854 (CHEMBL879226)
IC50 15.85±n/a nM
Citation Liu, HHuang, XShen, JLuo, XLi, MXiong, BChen, GShen, JYang, YJiang, HChen, K Inhibitory mode of 1,5-diarylpyrazole derivatives against cyclooxygenase-2 and cyclooxygenase-1: molecular docking and 3D QSAR analyses. J Med Chem45:4816-27 (2002) Prostaglandin G/H synthase 2
Name:Prostaglandin G/H synthase 2
Type:Protein
Mol. Mass.:69020.39
Organism:Mus musculus (Mouse)
Description:Q05769
Residue:604
BDBM50057573
NameBDBM50057573
Synonyms:4-[5-(4-Methylamino-phenyl)-3-trifluoromethyl-pyrazol-1-yl]-benzenesulfonamide | CHEMBL29439
TypeSmall organic molecule
Emp. Form.C17H15F3N4O2S
Mol. Mass.396.387
SMILESCNc1ccc(cc1)-c1cc(nn1-c1ccc(cc1)S(N)(=O)=O)C(F)(F)F