Reaction Details
TargetProstaglandin G/H synthase 2
LigandBDBM50057565
Substrate/Competitorn/a
Meas. Tech.ChEMBL_157854 (CHEMBL879226)
IC50 29512.09±n/a nM
Citation Liu, HHuang, XShen, JLuo, XLi, MXiong, BChen, GShen, JYang, YJiang, HChen, K Inhibitory mode of 1,5-diarylpyrazole derivatives against cyclooxygenase-2 and cyclooxygenase-1: molecular docking and 3D QSAR analyses. J Med Chem45:4816-27 (2002) Prostaglandin G/H synthase 2
Name:Prostaglandin G/H synthase 2
Type:Protein
Mol. Mass.:69020.39
Organism:Mus musculus (Mouse)
Description:Q05769
Residue:604
BDBM50057565
NameBDBM50057565
Synonyms:4-(4-Amino-5-phenyl-pyrazol-1-yl)-benzenesulfonamide | CHEMBL28487
TypeSmall organic molecule
Emp. Form.C15H14N4O2S
Mol. Mass.314.362
SMILESNc1cnn(c1-c1ccccc1)-c1ccc(cc1)S(N)(=O)=O