Reaction Details
TargetProstaglandin G/H synthase 1
LigandBDBM50057618
Substrate/Competitorn/a
Meas. Tech.ChEMBL_159436 (CHEMBL873459)
IC50 6309.57±n/a nM
Citation Liu, HHuang, XShen, JLuo, XLi, MXiong, BChen, GShen, JYang, YJiang, HChen, K Inhibitory mode of 1,5-diarylpyrazole derivatives against cyclooxygenase-2 and cyclooxygenase-1: molecular docking and 3D QSAR analyses. J Med Chem45:4816-27 (2002) Prostaglandin G/H synthase 1
Name:Prostaglandin G/H synthase 1
Type:Protein
Mol. Mass.:68868.60
Organism:Ovis aries (Sheep)
Description:n/a
Residue:600
BDBM50057618
NameBDBM50057618
Synonyms:4-[5-(3-Methyl-4-methylsulfanyl-phenyl)-3-trifluoromethyl-pyrazol-1-yl]-benzenesulfonamide | CHEMBL28913
TypeSmall organic molecule
Emp. Form.C18H16F3N3O2S2
Mol. Mass.427.464
SMILESCSc1ccc(cc1C)-c1cc(nn1-c1ccc(cc1)S(N)(=O)=O)C(F)(F)F