Reaction Details
TargetProstaglandin G/H synthase 2
LigandBDBM50057571
Substrate/Competitorn/a
Meas. Tech.ChEMBL_157854 (CHEMBL879226)
IC50 83.18±n/a nM
Citation Liu, HHuang, XShen, JLuo, XLi, MXiong, BChen, GShen, JYang, YJiang, HChen, K Inhibitory mode of 1,5-diarylpyrazole derivatives against cyclooxygenase-2 and cyclooxygenase-1: molecular docking and 3D QSAR analyses. J Med Chem45:4816-27 (2002) Prostaglandin G/H synthase 2
Name:Prostaglandin G/H synthase 2
Type:Protein
Mol. Mass.:69020.39
Organism:Mus musculus (Mouse)
Description:Q05769
Residue:604
BDBM50057571
NameBDBM50057571
Synonyms:4-(5-Cyclohex-1-enyl-3-trifluoromethyl-pyrazol-1-yl)-benzenesulfonamide | CHEMBL30091
TypeSmall organic molecule
Emp. Form.C16H16F3N3O2S
Mol. Mass.371.377
SMILESNS(=O)(=O)c1ccc(cc1)-n1nc(cc1C1=CCCCC1)C(F)(F)F