Reaction Details
TargetProstaglandin G/H synthase 1
LigandBDBM50057530
Substrate/Competitorn/a
Meas. Tech.ChEMBL_159436 (CHEMBL873459)
IC50>100000±n/a nM
Citation Liu, HHuang, XShen, JLuo, XLi, MXiong, BChen, GShen, JYang, YJiang, HChen, K Inhibitory mode of 1,5-diarylpyrazole derivatives against cyclooxygenase-2 and cyclooxygenase-1: molecular docking and 3D QSAR analyses. J Med Chem45:4816-27 (2002) Prostaglandin G/H synthase 1
Name:Prostaglandin G/H synthase 1
Type:Protein
Mol. Mass.:68868.60
Organism:Ovis aries (Sheep)
Description:n/a
Residue:600
BDBM50057530
NameBDBM50057530
Synonyms:4-(4-Methoxy-5-phenyl-3-trifluoromethyl-pyrazol-1-yl)-benzenesulfonamide | CHEMBL29842
TypeSmall organic molecule
Emp. Form.C17H14F3N3O3S
Mol. Mass.397.372
SMILESCOc1c(nn(c1-c1ccccc1)-c1ccc(cc1)S(N)(=O)=O)C(F)(F)F