Reaction Details
TargetProstaglandin G/H synthase 1
LigandBDBM50057542
Substrate/Competitorn/a
Meas. Tech.ChEMBL_159436 (CHEMBL873459)
IC50 33884.42±n/a nM
Citation Liu, HHuang, XShen, JLuo, XLi, MXiong, BChen, GShen, JYang, YJiang, HChen, K Inhibitory mode of 1,5-diarylpyrazole derivatives against cyclooxygenase-2 and cyclooxygenase-1: molecular docking and 3D QSAR analyses. J Med Chem45:4816-27 (2002) Prostaglandin G/H synthase 1
Name:Prostaglandin G/H synthase 1
Type:Protein
Mol. Mass.:68868.60
Organism:Ovis aries (Sheep)
Description:n/a
Residue:600
BDBM50057542
NameBDBM50057542
Synonyms:4-(3-Difluoromethyl-5-phenyl-pyrazol-1-yl)-benzenesulfonamide | CHEMBL29445
TypeSmall organic molecule
Emp. Form.C16H13F2N3O2S
Mol. Mass.349.355
SMILESNS(=O)(=O)c1ccc(cc1)-n1nc(cc1-c1ccccc1)C(F)F