Reaction Details
TargetProstaglandin G/H synthase 2
LigandBDBM50057619
Substrate/Competitorn/a
Meas. Tech.ChEMBL_157854 (CHEMBL879226)
IC50 158.49±n/a nM
Citation Liu, HHuang, XShen, JLuo, XLi, MXiong, BChen, GShen, JYang, YJiang, HChen, K Inhibitory mode of 1,5-diarylpyrazole derivatives against cyclooxygenase-2 and cyclooxygenase-1: molecular docking and 3D QSAR analyses. J Med Chem45:4816-27 (2002) Prostaglandin G/H synthase 2
Name:Prostaglandin G/H synthase 2
Type:Protein
Mol. Mass.:69020.39
Organism:Mus musculus (Mouse)
Description:Q05769
Residue:604
BDBM50057619
NameBDBM50057619
Synonyms:4-Chloro-5-(4-chloro-phenyl)-1-(4-sulfamoyl-phenyl)-1H-pyrazole-3-carboxylic acid methyl ester | CHEMBL28491
TypeSmall organic molecule
Emp. Form.C17H13Cl2N3O4S
Mol. Mass.426.274
SMILESCOC(=O)c1nn(c(c1Cl)-c1ccc(Cl)cc1)-c1ccc(cc1)S(N)(=O)=O