Reaction Details
TargetProstaglandin G/H synthase 1
LigandBDBM50057605
Substrate/Competitorn/a
Meas. Tech.ChEMBL_159436 (CHEMBL873459)
IC50 4677.35±n/a nM
Citation Liu, HHuang, XShen, JLuo, XLi, MXiong, BChen, GShen, JYang, YJiang, HChen, K Inhibitory mode of 1,5-diarylpyrazole derivatives against cyclooxygenase-2 and cyclooxygenase-1: molecular docking and 3D QSAR analyses. J Med Chem45:4816-27 (2002) Prostaglandin G/H synthase 1
Name:Prostaglandin G/H synthase 1
Type:Protein
Mol. Mass.:68868.60
Organism:Ovis aries (Sheep)
Description:n/a
Residue:600
BDBM50057605
NameBDBM50057605
Synonyms:4-[5-(5-Chloro-thiophen-2-yl)-3-trifluoromethyl-pyrazol-1-yl]-benzenesulfonamide | CHEMBL283177
TypeSmall organic molecule
Emp. Form.C14H9ClF3N3O2S2
Mol. Mass.407.818
SMILESNS(=O)(=O)c1ccc(cc1)-n1nc(cc1-c1ccc(Cl)s1)C(F)(F)F