Reaction Details
TargetLiver carboxylesterase
LigandBDBM50409665
Substrate/Competitorn/a
Meas. Tech.ChEMBL_45462 (CHEMBL657984)
IC50 67608297.54±n/a nM
Citation Wheelock, CEColvin, MEUemura, IOlmstead, MMSanborn, JRNakagawa, YJones, ADHammock, BD Use of ab initio calculations to predict the biological potency of carboxylesterase inhibitors. J Med Chem45:5576-93 (2002) Liver carboxylesterase
Name:Liver carboxylesterase
Type:PROTEIN
Mol. Mass.:62009.98
Organism:Sus scrofa
Description:ChEMBL_427761
Residue:566
BDBM50409665
NameBDBM50409665
Synonyms:CHEMBL47127
TypeSmall organic molecule
Emp. Form.C10H20O
Mol. Mass.156.2652
SMILESCCCCCCCCC(C)=O