Reaction Details
TargetAcylcarnitine hydrolase
LigandBDBM50409670
Substrate/Competitorn/a
Meas. Tech.ChEMBL_216226 (CHEMBL823860)
IC50 120.23±n/a nM
Citation Wheelock, CEColvin, MEUemura, IOlmstead, MMSanborn, JRNakagawa, YJones, ADHammock, BD Use of ab initio calculations to predict the biological potency of carboxylesterase inhibitors. J Med Chem45:5576-93 (2002) Acylcarnitine hydrolase
Name:Acylcarnitine hydrolase
Type:PROTEIN
Mol. Mass.:62457.35
Organism:Mus musculus
Description:ChEMBL_216226
Residue:561
BDBM50409670
NameBDBM50409670
Synonyms:CHEMBL421992
TypeSmall organic molecule
Emp. Form.C9H15F3O2
Mol. Mass.212.2094
SMILESCCCCCCOCC(=O)C(F)(F)F