Reaction Details
TargetCocaine esterase
LigandBDBM50371962
Substrate/Competitorn/a
Meas. Tech.ChEMBL_45459 (CHEMBL657981)
IC50 309.03±n/a nM
Citation Wheelock, CEColvin, MEUemura, IOlmstead, MMSanborn, JRNakagawa, YJones, ADHammock, BD Use of ab initio calculations to predict the biological potency of carboxylesterase inhibitors. J Med Chem45:5576-93 (2002) Cocaine esterase
Name:Cocaine esterase
Type:PROTEIN
Mol. Mass.:61801.08
Organism:Homo sapiens (Human)
Description:ChEMBL_1494240
Residue:559
BDBM50371962
NameBDBM50371962
Synonyms:CHEMBL155396
TypeSmall organic molecule
Emp. Form.C9H15F3O2S
Mol. Mass.244.274
SMILESCCCCCCS(=O)CC(=O)C(F)(F)F