Reaction Details
TargetIntegrase
LigandBDBM50029209
Substrate/Competitorn/a
Meas. Tech.ChEMBL_88769 (CHEMBL857173)
IC50 100000±n/a nM
Citation Buolamwini, JKAssefa, H CoMFA and CoMSIA 3D QSAR and docking studies on conformationally-restrained cinnamoyl HIV-1 integrase inhibitors: exploration of a binding mode at the active site. J Med Chem45:841-52 (2002) Integrase
Name:Integrase
Synonyms:Human immunodeficiency virus type 1 integrase
Type:PROTEIN
Mol. Mass.:32231.48
Organism:Human immunodeficiency virus 1
Description:ChEMBL_90865
Residue:288
BDBM50029209
NameBDBM50029209
TypeSmall organic molecule
Emp. Form.C10H10O4
Mol. Mass.194.184
SMILESCOC(=O)\C=C\c1ccc(O)c(O)c1