Reaction Details
TargetReceptor tyrosine-protein kinase erbB-2
LigandBDBM50036688
Substrate/Competitorn/a
Meas. Tech.ChEMBL_161600 (CHEMBL769140)
IC50 446.68±n/a nM
Citation Kamath, SBuolamwini, JK Receptor-guided alignment-based comparative 3D-QSAR studies of benzylidene malonitrile tyrphostins as EGFR and HER-2 kinase inhibitors. J Med Chem46:4657-68 (2003) 
 
Receptor tyrosine-protein kinase erbB-2
Name:Receptor tyrosine-protein kinase erbB-2
Type:n/a
Mol. Mass.:137894.47
Organism:Homo sapiens (Human)
Description:P04626
Residue:1255
BDBM50036688
NameBDBM50036688
Synonyms:2-[5-((E)-2-Carbamoyl-2-cyano-vinyl)-2-hydroxy-3-methoxy-benzylsulfanyl]-benzoic acid anion CHEMBL119987
TypeSmall organic molecule
Emp. Form.C19H16N2O5S
Mol. Mass.384.406
SMILESCOc1cc(\C=C(/C#N)C(N)=O)cc(CSc2ccccc2C(O)=O)c1O