Reaction Details
TargetEpidermal growth factor receptor
LigandBDBM4297
Substrate/Competitorn/a
Meas. Tech.ChEMBL_66876 (CHEMBL676067)
IC50 6606.93±n/a nM
Citation Kamath, SBuolamwini, JK Receptor-guided alignment-based comparative 3D-QSAR studies of benzylidene malonitrile tyrphostins as EGFR and HER-2 kinase inhibitors. J Med Chem46:4657-68 (2003) 
 
Epidermal growth factor receptor
Name:Epidermal growth factor receptor
Type:Receptor Kinase Domain
Mol. Mass.:134279.59
Organism:Homo sapiens (Human)
Description:P00533
Residue:1210
BDBM4297
NameBDBM4297
Synonyms:(2E)-2-[(2-chlorophenyl)carbonyl]-3-(3,4-dihydroxyphenyl)prop-2-enenitrile | Tyrphostin deriv. 30
TypeSmall organic molecule
Emp. Form.C16H10ClNO3
Mol. Mass.299.708
SMILESOc1ccc(\C=C(/C#N)C(=O)c2ccccc2Cl)cc1O