Reaction Details
TargetReceptor tyrosine-protein kinase erbB-2
LigandBDBM50036696
Substrate/Competitorn/a
Meas. Tech.ChEMBL_161600 (CHEMBL769140)
IC50 17378.01±n/a nM
Citation Kamath, SBuolamwini, JK Receptor-guided alignment-based comparative 3D-QSAR studies of benzylidene malonitrile tyrphostins as EGFR and HER-2 kinase inhibitors. J Med Chem46:4657-68 (2003) 
 
Receptor tyrosine-protein kinase erbB-2
Name:Receptor tyrosine-protein kinase erbB-2
Type:n/a
Mol. Mass.:137894.47
Organism:Homo sapiens (Human)
Description:P04626
Residue:1255
BDBM50036696
NameBDBM50036696
Synonyms:2-[4-Hydroxy-3-methoxy-5-(toluene-4-sulfonylmethyl)-benzylidene]-malononitrile | CHEMBL334032
TypeSmall organic molecule
Emp. Form.C19H16N2O4S
Mol. Mass.368.406
SMILES[#6]-[#8]-c1cc(\[#6]=[#6](/C#N)C#N)cc(-[#6]S(=O)(=O)c2ccc(-[#6])cc2)c1-[#8]