Reaction Details
TargetReceptor tyrosine-protein kinase erbB-2
LigandBDBM4310
Substrate/Competitorn/a
Meas. Tech.ChEMBL_161600 (CHEMBL769140)
IC50 16982.44±n/a nM
Citation Kamath, SBuolamwini, JK Receptor-guided alignment-based comparative 3D-QSAR studies of benzylidene malonitrile tyrphostins as EGFR and HER-2 kinase inhibitors. J Med Chem46:4657-68 (2003) 
 
Receptor tyrosine-protein kinase erbB-2
Name:Receptor tyrosine-protein kinase erbB-2
Type:n/a
Mol. Mass.:137894.47
Organism:Homo sapiens (Human)
Description:P04626
Residue:1255
BDBM4310
NameBDBM4310
Synonyms:(2E)-2-cyano-N-cyclohexyl-3-(3,4-dihydroxyphenyl)prop-2-enamide | Tyrphostin deriv. 60
TypeSmall organic molecule
Emp. Form.C16H18N2O3
Mol. Mass.286.3257
SMILESOc1ccc(\C=C(/C#N)C(=O)NC2CCCCC2)cc1O