Reaction Details
TargetEpidermal growth factor receptor
LigandBDBM4303
Substrate/Competitorn/a
Meas. Tech.ChEMBL_66876 (CHEMBL676067)
IC50 707.95±n/a nM
Citation Kamath, SBuolamwini, JK Receptor-guided alignment-based comparative 3D-QSAR studies of benzylidene malonitrile tyrphostins as EGFR and HER-2 kinase inhibitors. J Med Chem46:4657-68 (2003) 
 
Epidermal growth factor receptor
Name:Epidermal growth factor receptor
Type:Receptor Kinase Domain
Mol. Mass.:134279.59
Organism:Homo sapiens (Human)
Description:P00533
Residue:1210
BDBM4303
NameBDBM4303
Synonyms:(2E)-2-cyano-3-(3,4-dihydroxyphenyl)-N-(3-phenylpropyl)prop-2-enamide (E)-2-cyano-3-(3,4-dihydroxyphenyl)-N-(3-phenylpropyl)acrylamide (E)-3-[3,4-bis(oxidanyl)phenyl]-2-cyano-N-(3-phenylpropyl)prop-2-enamide MLS000069704 TYRPHOSTIN AG 555 cid_5328770
TypeSmall organic molecule
Emp. Form.C19H18N2O3
Mol. Mass.322.3578
SMILESOc1ccc(\C=C(/C#N)C(=O)NCCCc2ccccc2)cc1O