Reaction Details
TargetReceptor tyrosine-protein kinase erbB-2
LigandBDBM4307
Substrate/Competitorn/a
Meas. Tech.ChEMBL_161600 (CHEMBL769140)
IC50 57543.99±n/a nM
Citation Kamath, SBuolamwini, JK Receptor-guided alignment-based comparative 3D-QSAR studies of benzylidene malonitrile tyrphostins as EGFR and HER-2 kinase inhibitors. J Med Chem46:4657-68 (2003) 
 
Receptor tyrosine-protein kinase erbB-2
Name:Receptor tyrosine-protein kinase erbB-2
Type:n/a
Mol. Mass.:137894.47
Organism:Homo sapiens (Human)
Description:P04626
Residue:1255
BDBM4307
NameBDBM4307
Synonyms:(2E)-N-(2-chlorophenyl)-2-cyano-3-(3,4-dihydroxyphenyl)prop-2-enamide | Tyrphostin deriv. 54
TypeSmall organic molecule
Emp. Form.C16H11ClN2O3
Mol. Mass.314.723
SMILESOc1ccc(\C=C(/C#N)C(=O)Nc2ccccc2Cl)cc1O