Reaction Details
TargetEpidermal growth factor receptor
LigandBDBM50036689
Substrate/Competitorn/a
Meas. Tech.ChEMBL_66876 (CHEMBL676067)
IC50 6760.83±n/a nM
Citation Kamath, SBuolamwini, JK Receptor-guided alignment-based comparative 3D-QSAR studies of benzylidene malonitrile tyrphostins as EGFR and HER-2 kinase inhibitors. J Med Chem46:4657-68 (2003) 
 
Epidermal growth factor receptor
Name:Epidermal growth factor receptor
Type:Receptor Kinase Domain
Mol. Mass.:134279.59
Organism:Homo sapiens (Human)
Description:P00533
Residue:1210
BDBM50036689
NameBDBM50036689
Synonyms:2-(4-Hydroxy-3-methoxy-5-phenylsulfanylmethyl-benzylidene)-malononitrile | CHEMBL122522
TypeSmall organic molecule
Emp. Form.C18H14N2O2S
Mol. Mass.322.381
SMILES[#6]-[#8]-c1cc(\[#6]=[#6](/C#N)C#N)cc(-[#6]-[#16]-c2ccccc2)c1-[#8]