Reaction Details
TargetReceptor tyrosine-protein kinase erbB-2
LigandBDBM50036681
Substrate/Competitorn/a
Meas. Tech.ChEMBL_161600 (CHEMBL769140)
IC50 8709.64±n/a nM
Citation Kamath, SBuolamwini, JK Receptor-guided alignment-based comparative 3D-QSAR studies of benzylidene malonitrile tyrphostins as EGFR and HER-2 kinase inhibitors. J Med Chem46:4657-68 (2003) 
 
Receptor tyrosine-protein kinase erbB-2
Name:Receptor tyrosine-protein kinase erbB-2
Type:n/a
Mol. Mass.:137894.47
Organism:Homo sapiens (Human)
Description:P04626
Residue:1255
BDBM50036681
NameBDBM50036681
Synonyms:(E)-2-Cyano-3-[3-(4,5-dihydro-thiazol-2-ylsulfanylmethyl)-4-hydroxy-5-methoxy-phenyl]-acrylamide CHEMBL324030
TypeSmall organic molecule
Emp. Form.C15H15N3O3S2
Mol. Mass.349.428
SMILESCOc1cc(\C=C(/C#N)C(N)=O)cc(CSC2=NCCS2)c1O