Reaction Details
TargetEpidermal growth factor receptor
LigandBDBM50036695
Substrate/Competitorn/a
Meas. Tech.ChEMBL_66876 (CHEMBL676067)
IC50 7943.28±n/a nM
Citation Kamath, SBuolamwini, JK Receptor-guided alignment-based comparative 3D-QSAR studies of benzylidene malonitrile tyrphostins as EGFR and HER-2 kinase inhibitors. J Med Chem46:4657-68 (2003) 
 
Epidermal growth factor receptor
Name:Epidermal growth factor receptor
Type:Receptor Kinase Domain
Mol. Mass.:134279.59
Organism:Homo sapiens (Human)
Description:P00533
Residue:1210
BDBM50036695
NameBDBM50036695
Synonyms:2-[5-(2,2-Dicyano-vinyl)-2-hydroxy-3-methoxy-benzylsulfanyl]-benzoic acid CHEMBL118321
TypeSmall organic molecule
Emp. Form.C19H14N2O4S
Mol. Mass.366.39
SMILES[#6]-[#8]-c1cc(\[#6]=[#6](/C#N)C#N)cc(-[#6]-[#16]-c2ccccc2-[#6](-[#8])=O)c1-[#8]