Reaction Details
TargetReceptor tyrosine-protein kinase erbB-2
LigandBDBM50409738
Substrate/Competitorn/a
Meas. Tech.ChEMBL_161600 (CHEMBL769140)
IC50 1995.26±n/a nM
Citation Kamath, SBuolamwini, JK Receptor-guided alignment-based comparative 3D-QSAR studies of benzylidene malonitrile tyrphostins as EGFR and HER-2 kinase inhibitors. J Med Chem46:4657-68 (2003) 
 
Receptor tyrosine-protein kinase erbB-2
Name:Receptor tyrosine-protein kinase erbB-2
Type:n/a
Mol. Mass.:137894.47
Organism:Homo sapiens (Human)
Description:P04626
Residue:1255
BDBM50409738
NameBDBM50409738
Synonyms:CHEMBL141175
TypeSmall organic molecule
Emp. Form.C19H17ClN2O3S
Mol. Mass.388.868
SMILESCOc1cc(\C=C(\C#N)C(N)=O)cc(CSCc2ccc(Cl)cc2)c1O