Reaction Details
TargetReceptor tyrosine-protein kinase erbB-2
LigandBDBM4294
Substrate/Competitorn/a
Meas. Tech.ChEMBL_161600 (CHEMBL769140)
IC50 12882.5±n/a nM
Citation Kamath, SBuolamwini, JK Receptor-guided alignment-based comparative 3D-QSAR studies of benzylidene malonitrile tyrphostins as EGFR and HER-2 kinase inhibitors. J Med Chem46:4657-68 (2003) 
 
Receptor tyrosine-protein kinase erbB-2
Name:Receptor tyrosine-protein kinase erbB-2
Type:n/a
Mol. Mass.:137894.47
Organism:Homo sapiens (Human)
Description:P04626
Residue:1255
BDBM4294
NameBDBM4294
Synonyms:(2E)-3-(3,4-dihydroxyphenyl)-2-[(4-fluorophenyl)carbonyl]prop-2-enenitrile Tyrphostin deriv. 25
TypeSmall organic molecule
Emp. Form.C16H10FNO3
Mol. Mass.283.2539
SMILESOc1ccc(\C=C(/C#N)C(=O)c2ccc(F)cc2)cc1O