Reaction Details
TargetEpidermal growth factor receptor
LigandBDBM4302
Substrate/Competitorn/a
Meas. Tech.ChEMBL_66876 (CHEMBL676067)
IC50 2511.89±n/a nM
Citation Kamath, SBuolamwini, JK Receptor-guided alignment-based comparative 3D-QSAR studies of benzylidene malonitrile tyrphostins as EGFR and HER-2 kinase inhibitors. J Med Chem46:4657-68 (2003) 
 
Epidermal growth factor receptor
Name:Epidermal growth factor receptor
Type:Receptor Kinase Domain
Mol. Mass.:134279.59
Organism:Homo sapiens (Human)
Description:P00533
Residue:1210
BDBM4302
NameBDBM4302
Synonyms:(2E)-2-cyano-3-(3,4-dihydroxyphenyl)-N-[(1R)-1-phenylethyl]prop-2-enamide cid_5328772
TypeSmall organic molecule
Emp. Form.C18H16N2O3
Mol. Mass.308.3312
SMILESC[C@@H](NC(=O)C(=C\c1ccc(O)c(O)c1)\C#N)c1ccccc1