Reaction Details
TargetReceptor tyrosine-protein kinase erbB-2
LigandBDBM50409740
Substrate/Competitorn/a
Meas. Tech.ChEMBL_161600 (CHEMBL769140)
IC50 2884.03±n/a nM
Citation Kamath, SBuolamwini, JK Receptor-guided alignment-based comparative 3D-QSAR studies of benzylidene malonitrile tyrphostins as EGFR and HER-2 kinase inhibitors. J Med Chem46:4657-68 (2003) 
 
Receptor tyrosine-protein kinase erbB-2
Name:Receptor tyrosine-protein kinase erbB-2
Type:n/a
Mol. Mass.:137894.47
Organism:Homo sapiens (Human)
Description:P04626
Residue:1255
BDBM50409740
NameBDBM50409740
Synonyms:CHEMBL143805
TypeSmall organic molecule
Emp. Form.C17H14N2O4
Mol. Mass.310.3041
SMILESOc1ccc(CNC(=O)C(=C\c2ccc(O)c(O)c2)\C#N)cc1