Reaction Details
TargetEpidermal growth factor receptor
LigandBDBM4310
Substrate/Competitorn/a
Meas. Tech.ChEMBL_66876 (CHEMBL676067)
IC50 5888.44±n/a nM
Citation Kamath, SBuolamwini, JK Receptor-guided alignment-based comparative 3D-QSAR studies of benzylidene malonitrile tyrphostins as EGFR and HER-2 kinase inhibitors. J Med Chem46:4657-68 (2003) 
 
Epidermal growth factor receptor
Name:Epidermal growth factor receptor
Type:Receptor Kinase Domain
Mol. Mass.:134279.59
Organism:Homo sapiens (Human)
Description:P00533
Residue:1210
BDBM4310
NameBDBM4310
Synonyms:(2E)-2-cyano-N-cyclohexyl-3-(3,4-dihydroxyphenyl)prop-2-enamide | Tyrphostin deriv. 60
TypeSmall organic molecule
Emp. Form.C16H18N2O3
Mol. Mass.286.3257
SMILESOc1ccc(\C=C(/C#N)C(=O)NC2CCCCC2)cc1O