Reaction Details
Target5-hydroxytryptamine receptor 1D
LigandBDBM50001524
Substrate/Competitorn/a
Meas. Tech.ChEMBL_1755 (CHEMBL616541)
Ki 1122±n/a nM
Citation Riemer, CBorroni, ELevet-Trafit, BMartin, JRPoli, SPorter, RHBös, M Influence of the 5-HT6 receptor on acetylcholine release in the cortex: pharmacological characterization of 4-(2-bromo-6-pyrrolidin-1-ylpyridine-4-sulfonyl)phenylamine, a potent and selective 5-HT6 receptor antagonist. J Med Chem46:1273-6 (2003) 
 
5-hydroxytryptamine receptor 1D
Name:5-hydroxytryptamine receptor 1D
Type:G Protein-Coupled Receptor (GPCR)
Mol. Mass.:41920.63
Organism:Homo sapiens (Human)
Description:Receptor binding assays were performed using human clone stably expressed in CHO cells.
Residue:377
BDBM50001524
NameBDBM50001524
Synonyms:CHEMBL24474
TypeSmall organic molecule
Emp. Form.C15H17BrN4O2S
Mol. Mass.397.29
SMILESNc1ccc(cc1)S(=O)(=O)c1cc(Br)nc(c1)N1CCNCC1