Reaction Details
TargetIntegrase
LigandBDBM50409850
Substrate/Competitorn/a
Meas. Tech.ChEMBL_88770 (CHEMBL701802)
IC50 6025.6±n/a nM
Citation Kuo, CLAssefa, HKamath, SBrzozowski, ZSlawinski, JSaczewski, FBuolamwini, JKNeamati, N Application of CoMFA and CoMSIA 3D-QSAR and docking studies in optimization of mercaptobenzenesulfonamides as HIV-1 integrase inhibitors. J Med Chem47:385-99 (2004) 
 
Integrase
Name:Integrase
Synonyms:Human immunodeficiency virus type 1 integrase
Type:PROTEIN
Mol. Mass.:32231.48
Organism:Human immunodeficiency virus 1
Description:ChEMBL_90865
Residue:288
BDBM50409850
NameBDBM50409850
Synonyms:CHEMBL128376
TypeSmall organic molecule
Emp. Form.C22H18ClN5O3S2
Mol. Mass.499.993
SMILESCc1ccc(cc1)-n1cnnc1NS(=O)(=O)c1cc(C(=O)Nc2ccccc2)c(Cl)cc1S