Reaction Details
TargetIntegrase
LigandBDBM50409842
Substrate/Competitorn/a
Meas. Tech.ChEMBL_88771 (CHEMBL701803)
IC50 3467.37±n/a nM
Citation Kuo, CLAssefa, HKamath, SBrzozowski, ZSlawinski, JSaczewski, FBuolamwini, JKNeamati, N Application of CoMFA and CoMSIA 3D-QSAR and docking studies in optimization of mercaptobenzenesulfonamides as HIV-1 integrase inhibitors. J Med Chem47:385-99 (2004) 
 
Integrase
Name:Integrase
Synonyms:Human immunodeficiency virus type 1 integrase
Type:PROTEIN
Mol. Mass.:32231.48
Organism:Human immunodeficiency virus 1
Description:ChEMBL_90865
Residue:288
BDBM50409842
NameBDBM50409842
Synonyms:CHEMBL340697
TypeSmall organic molecule
Emp. Form.C15H12ClN5O2S3
Mol. Mass.425.936
SMILESCc1csc2ncn3c(NS(=O)(=O)c4cc(C)c(Cl)cc4S)nnc3c12