Reaction Details
TargetIntegrase
LigandBDBM50409868
Substrate/Competitorn/a
Meas. Tech.ChEMBL_88771 (CHEMBL701803)
IC50 3548.13±n/a nM
Citation Kuo, CLAssefa, HKamath, SBrzozowski, ZSlawinski, JSaczewski, FBuolamwini, JKNeamati, N Application of CoMFA and CoMSIA 3D-QSAR and docking studies in optimization of mercaptobenzenesulfonamides as HIV-1 integrase inhibitors. J Med Chem47:385-99 (2004) 
 
Integrase
Name:Integrase
Synonyms:Human immunodeficiency virus type 1 integrase
Type:PROTEIN
Mol. Mass.:32231.48
Organism:Human immunodeficiency virus 1
Description:ChEMBL_90865
Residue:288
BDBM50409868
NameBDBM50409868
Synonyms:CHEMBL130024
TypeSmall organic molecule
Emp. Form.C14H14Cl2N4O2S2
Mol. Mass.405.323
SMILESCc1cc(c(S)cc1Cl)S(=O)(=O)NC(Nc1ccc(Cl)cc1)=NN