Reaction Details
TargetSynaptic vesicle glycoprotein 2A
LigandBDBM50422545
Substrate/Competitorn/a
Meas. Tech.ChEMBL_100153 (CHEMBL857182)
IC50 1250±n/a nM
Citation Kenda, BMMatagne, ACTalaga, PEPasau, PMDifferding, ELallemand, BIFrycia, AMMoureau, FGKlitgaard, HVGillard, MRFuks, BMichel, P Discovery of 4-substituted pyrrolidone butanamides as new agents with significant antiepileptic activity. J Med Chem47:530-49 (2004) 
 
Synaptic vesicle glycoprotein 2A
Name:Synaptic vesicle glycoprotein 2A
Type:PROTEIN
Mol. Mass.:82648.76
Organism:Rattus norvegicus
Description:ChEMBL_100153
Residue:742
BDBM50422545
NameBDBM50422545
Synonyms:CHEMBL345318
TypeSmall organic molecule
Emp. Form.C10H18N2O2
Mol. Mass.198.2621
SMILESCC[C@H](N1CC(CC)CC1=O)C(N)=O