Reaction Details
TargetSynaptic vesicle glycoprotein 2A
LigandBDBM50422558
Substrate/Competitorn/a
Meas. Tech.ChEMBL_100153 (CHEMBL857182)
IC50 79.4±n/a nM
Citation Kenda, BMMatagne, ACTalaga, PEPasau, PMDifferding, ELallemand, BIFrycia, AMMoureau, FGKlitgaard, HVGillard, MRFuks, BMichel, P Discovery of 4-substituted pyrrolidone butanamides as new agents with significant antiepileptic activity. J Med Chem47:530-49 (2004) 
 
Synaptic vesicle glycoprotein 2A
Name:Synaptic vesicle glycoprotein 2A
Type:PROTEIN
Mol. Mass.:82648.76
Organism:Rattus norvegicus
Description:ChEMBL_100153
Residue:742
BDBM50422558
NameBDBM50422558
Synonyms:CHEMBL434705
TypeSmall organic molecule
Emp. Form.C9H15N5O2
Mol. Mass.225.2477
SMILESCC[C@H](N1C[C@H](CN=[N+]=[N-])CC1=O)C(N)=O