Reaction Details
TargetGonadotropin-releasing hormone receptor
LigandBDBM50409920
Substrate/Competitorn/a
Meas. Tech.ChEMBL_100148 (CHEMBL712505)
Ki 15±n/a nM
Citation Randolph, JTWaid, PNichols, CSauer, DHaviv, FDiaz, GBammert, GBesecke, LMSegreti, JAMohning, KMBush, ENWegner, CDGreer, J Nonpeptide luteinizing hormone-releasing hormone antagonists derived from erythromycin A: design, synthesis, and biological activity of cladinose replacement analogues. J Med Chem47:1085-97 (2004) 
 
Gonadotropin-releasing hormone receptor
Name:Gonadotropin-releasing hormone receptor
Type:Enzyme
Mol. Mass.:37749.45
Organism:Homo sapiens (Human)
Description:P30968
Residue:328
BDBM50409920
NameBDBM50409920
Synonyms:CHEMBL273440
TypeSmall organic molecule
Emp. Form.C46H69Cl2N3O13
Mol. Mass.942.958
SMILESCC[C@H]1OC(=O)[C@H](C)[C@@H](OC(=O)N2[C@@H](C)COC2=O)[C@H](C)[C@@H](OC2O[C@H](C)C[C@@H]([C@H]2O)N(C)C(C)C)[C@](C)(C[C@@H](C)C(=O)[C@H](C)[C@H]2N(CCc3ccc(Cl)c(Cl)c3)C(=O)O[C@]12C)OC