Reaction Details
TargetGonadotropin-releasing hormone receptor
LigandBDBM50409919
Substrate/Competitorn/a
Meas. Tech.ChEMBL_100148 (CHEMBL712505)
Ki 0.33±n/a nM
Citation Randolph, JTWaid, PNichols, CSauer, DHaviv, FDiaz, GBammert, GBesecke, LMSegreti, JAMohning, KMBush, ENWegner, CDGreer, J Nonpeptide luteinizing hormone-releasing hormone antagonists derived from erythromycin A: design, synthesis, and biological activity of cladinose replacement analogues. J Med Chem47:1085-97 (2004) 
 
Gonadotropin-releasing hormone receptor
Name:Gonadotropin-releasing hormone receptor
Type:Enzyme
Mol. Mass.:37749.45
Organism:Homo sapiens (Human)
Description:P30968
Residue:328
BDBM50409919
NameBDBM50409919
Synonyms:CHEMBL12282
TypeSmall organic molecule
Emp. Form.C47H69ClFN3O13
Mol. Mass.938.514
SMILESCC[C@H]1OC(=O)[C@H](C)[C@@H](OC(=O)N2[C@@H](C)COC2=O)[C@H](C)[C@@H](OC2O[C@H](C)C[C@@H]([C@H]2O)N(C)CC2CC2)[C@](C)(C[C@@H](C)C(=O)[C@H](C)[C@H]2N(CCc3ccc(F)c(Cl)c3)C(=O)O[C@]12C)OC