Reaction Details
TargetGonadotropin-releasing hormone receptor
LigandBDBM50001559
Substrate/Competitorn/a
Meas. Tech.ChEMBL_100151 (CHEMBL712508)
Ki 8.9±n/a nM
Citation Randolph, JTWaid, PNichols, CSauer, DHaviv, FDiaz, GBammert, GBesecke, LMSegreti, JAMohning, KMBush, ENWegner, CDGreer, J Nonpeptide luteinizing hormone-releasing hormone antagonists derived from erythromycin A: design, synthesis, and biological activity of cladinose replacement analogues. J Med Chem47:1085-97 (2004) 
 
Gonadotropin-releasing hormone receptor
Name:Gonadotropin-releasing hormone receptor
Type:PROTEIN
Mol. Mass.:37767.60
Organism:Rattus norvegicus
Description:ChEMBL_1335047
Residue:327
BDBM50001559
NameBDBM50001559
Synonyms:CHEMBL273536
TypeSmall organic molecule
Emp. Form.C47H72ClN3O13
Mol. Mass.922.54
SMILES[H][C@@]12[C@@H](C)C(=O)[C@H](C)C[C@](C)(OC)[C@H](OC3O[C@H](C)C[C@@H]([C@H]3O)N(C)C(C)C)[C@@H](C)[C@H](OC(=O)N3C(=O)OCC3(C)C)[C@@H](C)C(=O)O[C@H](CC)[C@@]1(C)OC(=O)N2CCc1ccc(Cl)cc1