Reaction Details
TargetIntegrin alpha-V/beta-3
LigandBDBM50152786
Substrate/Competitorn/a
Meas. Tech.ChEMBL_304995 (CHEMBL877467)
IC50 0.4±n/a nM
Citation Whitman, DBAskew, BCDuong, le TFernandez-Metzler, CHalczenko, WHartman, GDHutchinson, JHLeu, CTPrueksaritanont, TRodan, GARodan, SBDuggan, ME Nonpeptide alpha V beta 3 antagonists. Part 9: Improved pharmacokinetic profile through the use of an aliphatic, des-amide backbone. Bioorg Med Chem Lett14:4411-5 (2004) 
 
Integrin alpha-V/beta-3
Name:Integrin alpha-V/beta-3
Type:Enzyme
Mol. Mass.:n/a
Description:n/a
Components:This complex has 2 components.
Component 1
Name:Integrin alpha-V
Synonyms:ITAV_HUMAN Integrin alpha-V/alpha-5 VNRA Vitronectin receptor | Vitronectin receptor subunit alpha
Type:PROTEIN
Mol. Mass.:116024.92
Organism:Homo sapiens (Human)
Description:ChEMBL_582336
Residue:1048
Component 2
Name:Integrin beta-3
Synonyms:CD_antigen=CD61 GPIIIa ITGB3 Platelet membrane glycoprotein IIIa
Type:Protein
Mol. Mass.:87038.91
Organism:Homo sapiens (Human)
Description:P05106
Residue:788
BDBM50152786
NameBDBM50152786
Synonyms:(S)-3-(5-5,6,7,8-Tetrahydro-[1,8]naphthyridin-2-yl-pentanoylamino)-2-(toluene-4-sulfonylamino)-propionic acid | CHEMBL182537
TypeSmall organic molecule
Emp. Form.C23H30N4O5S
Mol. Mass.474.573
SMILESCc1ccc(cc1)S(=O)(=O)N[C@@H](CNC(=O)CCCCc1ccc2CCCNc2n1)C(O)=O