Reaction Details
TargetIntegrin alpha-V/beta-3
LigandBDBM50152791
Substrate/Competitorn/a
Meas. Tech.ChEMBL_304995 (CHEMBL877467)
IC50 0.1±n/a nM
Citation Whitman, DBAskew, BCDuong, le TFernandez-Metzler, CHalczenko, WHartman, GDHutchinson, JHLeu, CTPrueksaritanont, TRodan, GARodan, SBDuggan, ME Nonpeptide alpha V beta 3 antagonists. Part 9: Improved pharmacokinetic profile through the use of an aliphatic, des-amide backbone. Bioorg Med Chem Lett14:4411-5 (2004) 
 
Integrin alpha-V/beta-3
Name:Integrin alpha-V/beta-3
Type:Enzyme
Mol. Mass.:n/a
Description:n/a
Components:This complex has 2 components.
Component 1
Name:Integrin alpha-V
Synonyms:ITAV_HUMAN Integrin alpha-V/alpha-5 VNRA Vitronectin receptor | Vitronectin receptor subunit alpha
Type:PROTEIN
Mol. Mass.:116024.92
Organism:Homo sapiens (Human)
Description:ChEMBL_582336
Residue:1048
Component 2
Name:Integrin beta-3
Synonyms:CD_antigen=CD61 GPIIIa ITGB3 Platelet membrane glycoprotein IIIa
Type:Protein
Mol. Mass.:87038.91
Organism:Homo sapiens (Human)
Description:P05106
Residue:788
BDBM50152791
NameBDBM50152791
Synonyms:(S)-2-((1S,4R)-7,7-Dimethyl-2-oxo-bicyclo[2.2.1]hept-1-ylmethanesulfonylamino)-3-(5-5,6,7,8-tetrahydro-[1,8]naphthyridin-2-yl-pentanoylamino)-propionic acid | CHEMBL181758
TypeSmall organic molecule
Emp. Form.C26H38N4O6S
Mol. Mass.534.668
SMILESCC1(C)[C@@H]2CC[C@@]1(CS(=O)(=O)N[C@@H](CNC(=O)CCCCc1ccc3CCCNc3n1)C(O)=O)C(=O)C2