Reaction Details
TargetPotassium voltage-gated channel subfamily H member 2
LigandBDBM50241107
Substrate/Competitorn/a
Meas. Tech.ChEMBL_307245 (CHEMBL829152)
IC50 162.18±n/a nM
Citation Tobita, MNishikawa, TNagashima, R A discriminant model constructed by the support vector machine method for HERG potassium channel inhibitors. Bioorg Med Chem Lett15:2886-90 (2005) 
 
Potassium voltage-gated channel subfamily H member 2
Name:Potassium voltage-gated channel subfamily H member 2
Type:Multi-pass membrane protein
Mol. Mass.:126672.65
Organism:Homo sapiens (Human)
Description:Q12809
Residue:1159
BDBM50241107
NameBDBM50241107
Synonyms:1-(3-(4-(5-chloro-2-oxo-2,3-dihydrobenzo[d]imidazol-1-yl)piperidin-1-yl)propyl)-1H-benzo[d]imidazol-2(3H)-one 5-Chloro-1-{1-[3-(2-oxo-2,3-dihydro-benzoimidazol-1-yl)-propyl]-piperidin-4-yl}-1,3-dihydro-benzoimidazol-2-one(domperidone) 5-chloro-1-{1-[3-(2-oxo-2,3-dihydro-benzoimidazol-1-yl)-propyl]-piperidin-4-yl}-1,3-dihydro-benzoimidazol-2-one CHEMBL219916 DOMPERIDONE5-Chloro-1-{1-[3-(2-oxo-2,3-dihydro-benzoimidazol-1-yl)-propyl]-piperidin-4-yl}-1,3-dihydro-benzoimidazol-2-one US9132134, Domperidone
TypeSmall organic molecule
Emp. Form.C22H24ClN5O2
Mol. Mass.425.911
SMILESClc1ccc2n(C3CCN(CCCn4c5ccccc5[nH]c4=O)CC3)c(=O)[nH]c2c1