Reaction Details
TargetPotassium voltage-gated channel subfamily H member 2
LigandBDBM50318494
Substrate/Competitorn/a
Meas. Tech.ChEMBL_307245 (CHEMBL829152)
IC50 10000±n/a nM
Citation Tobita, MNishikawa, TNagashima, R A discriminant model constructed by the support vector machine method for HERG potassium channel inhibitors. Bioorg Med Chem Lett15:2886-90 (2005) 
 
Potassium voltage-gated channel subfamily H member 2
Name:Potassium voltage-gated channel subfamily H member 2
Type:Multi-pass membrane protein
Mol. Mass.:126672.65
Organism:Homo sapiens (Human)
Description:Q12809
Residue:1159
BDBM50318494
NameBDBM50318494
Synonyms:3-ethyl 5-methyl 2,6-dimethyl-4-(3-nitrophenyl)-1,4-dihydropyridine-3,5-dicarboxylate NITRENDIPINE | cid_4507
TypeSmall organic molecule
Emp. Form.C18H20N2O6
Mol. Mass.360.3612
SMILESCCOC(=O)C1=C(C)N=C(C)C(C1c1cccc(c1)[N+]([O-])=O)C(=O)OC