Reaction Details
TargetATP-dependent molecular chaperone HSP82
LigandBDBM15362
Substrate/Competitorn/a
Meas. Tech.ChEMBL_304597 (CHEMBL828486)
IC50 8900±n/a nM
Citation Cheung, KMMatthews, TPJames, KRowlands, MGBoxall, KJSharp, SYMaloney, ARoe, SMProdromou, CPearl, LHAherne, GWMcDonald, EWorkman, P The identification, synthesis, protein crystal structure and in vitro biochemical evaluation of a new 3,4-diarylpyrazole class of Hsp90 inhibitors. Bioorg Med Chem Lett15:3338-43 (2005) 
 
ATP-dependent molecular chaperone HSP82
Name:ATP-dependent molecular chaperone HSP82
Type:Molecular Chaperone
Mol. Mass.:81369.08
Organism:Saccharomyces cerevisiae
Description:Histidine-tagged yeast HSP90 was transformed into E. coli and purified (>90%) by metal affinity, gel filtration, and ion-exchange chromatography.
Residue:709
BDBM15362
NameBDBM15362
Synonyms:4-[4-(2,3-dihydro-1,4-benzodioxin-6-yl)-5-methyl-1H-pyrazol-3-yl]-6-ethylbenzene-1,3-diol CHEMBL399530 | VER-00063579
TypeSmall organic molecule
Emp. Form.C20H20N2O4
Mol. Mass.352.3838
SMILESCCc1cc(-c2n[nH]c(C)c2-c2ccc3OCCOc3c2)c(O)cc1O