Reaction Details
TargetATP-dependent molecular chaperone HSP82
LigandBDBM15363
Substrate/Competitorn/a
Meas. Tech.ChEMBL_304597 (CHEMBL828486)
IC50 60800±n/a nM
Citation Cheung, KMMatthews, TPJames, KRowlands, MGBoxall, KJSharp, SYMaloney, ARoe, SMProdromou, CPearl, LHAherne, GWMcDonald, EWorkman, P The identification, synthesis, protein crystal structure and in vitro biochemical evaluation of a new 3,4-diarylpyrazole class of Hsp90 inhibitors. Bioorg Med Chem Lett15:3338-43 (2005) 
 
ATP-dependent molecular chaperone HSP82
Name:ATP-dependent molecular chaperone HSP82
Type:Molecular Chaperone
Mol. Mass.:81369.08
Organism:Saccharomyces cerevisiae
Description:Histidine-tagged yeast HSP90 was transformed into E. coli and purified (>90%) by metal affinity, gel filtration, and ion-exchange chromatography.
Residue:709
BDBM15363
NameBDBM15363
Synonyms:4-[4-(2,3-dihydro-1,4-benzodioxin-6-yl)-5-methyl-1H-pyrazol-3-yl]benzene-1,3-diol | CCT018159 analog 2
TypeSmall organic molecule
Emp. Form.C18H16N2O4
Mol. Mass.324.3306
SMILESCc1[nH]nc(c1-c1ccc2OCCOc2c1)-c1ccc(O)cc1O