Reaction Details
TargetCyclin-dependent kinase inhibitor 1
LigandBDBM50410013
Substrate/Competitorn/a
Meas. Tech.ChEMBL_312419 (CHEMBL832970)
IC50>20000±n/a nM
Citation Wang, YDJohnson, SPowell, DMcGinnis, JPMiranda, MRabindran, SK Inhibition of tumor cell proliferation by thieno[2,3-d]pyrimidin-4(1H)-one-based analogs. Bioorg Med Chem Lett15:3763-6 (2005) 
 
Cyclin-dependent kinase inhibitor 1
Name:Cyclin-dependent kinase inhibitor 1
Type:PROTEIN
Mol. Mass.:18123.15
Organism:Homo sapiens (Human)
Description:ChEMBL_312386
Residue:164
BDBM50410013
NameBDBM50410013
Synonyms:CHEMBL179155
TypeSmall organic molecule
Emp. Form.C21H23NO4S
Mol. Mass.385.477
SMILESCOc1cc(cc(OC)c1OC)-c1cc(OC)c2c3CCCCc3sc2n1