Reaction Details
TargetCyclin-dependent kinase inhibitor 1
LigandBDBM50410026
Substrate/Competitorn/a
Meas. Tech.ChEMBL_312419 (CHEMBL832970)
IC50>20000±n/a nM
Citation Wang, YDJohnson, SPowell, DMcGinnis, JPMiranda, MRabindran, SK Inhibition of tumor cell proliferation by thieno[2,3-d]pyrimidin-4(1H)-one-based analogs. Bioorg Med Chem Lett15:3763-6 (2005) 
 
Cyclin-dependent kinase inhibitor 1
Name:Cyclin-dependent kinase inhibitor 1
Type:PROTEIN
Mol. Mass.:18123.15
Organism:Homo sapiens (Human)
Description:ChEMBL_312386
Residue:164
BDBM50410026
NameBDBM50410026
Synonyms:CHEMBL178907
TypeSmall organic molecule
Emp. Form.C16H13N3O3S
Mol. Mass.327.358
SMILES[O-][N+](=O)c1ccc(cc1)-c1nc2sc3CCCCc3c2c(=O)[nH]1