Reaction Details
TargetAcetylcholine receptor subunit alpha/beta/delta/gamma
LigandBDBM50161090
Substrate/Competitorn/a
Meas. Tech.ChEMBL_310491 (CHEMBL834065)
EC50 28±n/a nM
Citation Fitch, RWKaneko, YKlaperski, PDaly, JWSeitz, GGündisch, D Halogenated and isosteric cytisine derivatives with increased affinity and functional activity at nicotinic acetylcholine receptors. Bioorg Med Chem Lett15:1221-4 (2005) 
 
Acetylcholine receptor subunit alpha/beta/delta/gamma
Name:Acetylcholine receptor subunit alpha/beta/delta/gamma
Type:n/a
Mol. Mass.:n/a
Description:ASSAY_ID of EBI is 369002
Components:This complex has 4 components.
Component 1
Name:Acetylcholine receptor subunit alpha
Synonyms:ACHA_HUMAN Acetylcholine receptor protein alpha chain CHNRA Cholinergic, Nicotinic Alpha1Beta1DeltaGamma Nicotinic acetylcholine receptor alpha-1/beta-1 Nicotinic acetylcholine receptor alpha2/beta4 n-AChR
Type:Ion channel
Mol. Mass.:54542.01
Organism:Homo sapiens (Human)
Description:n/a
Residue:482
Component 2
Name:Acetylcholine receptor subunit beta
Synonyms:ACHB_HUMAN Acetylcholine receptor subunit beta CHRNB1 | Nicotinic acetylcholine receptor alpha-1/beta-1/delta/epsilon
Type:PROTEIN
Mol. Mass.:56691.23
Organism:Homo sapiens (Human)
Description:EBI_10924
Residue:501
Component 3
Name:Acetylcholine receptor subunit gamma
Synonyms:ACHG_HUMAN Acetylcholine receptor subunit gamma Muscle-type nicotinic acetylcholine receptor
Type:PROTEIN
Mol. Mass.:57880.69
Organism:Homo sapiens (Human)
Description:EBI_11211
Residue:517
Component 4
Name:Acetylcholine receptor subunit delta
Synonyms:ACHD_HUMAN Acetylcholine receptor protein delta chain Muscle-type nicotinic acetylcholine receptor | Nicotinic acetylcholine receptor alpha-1/beta-1/delta/epsilon
Type:PROTEIN
Mol. Mass.:58894.39
Organism:Homo sapiens (Human)
Description:ChEMBL_142595
Residue:517
BDBM50161090
NameBDBM50161090
Synonyms:9-Chloro-1,2,3,4,5,6-hexahydro-1,5-methano-pyrido[1,2-a][1,5]diazocin-8-one | CHEMBL64496
TypeSmall organic molecule
Emp. Form.C11H13ClN2O
Mol. Mass.224.687
SMILESClc1ccc2C3CNCC(C3)Cn2c1=O