Reaction Details
TargetEstrogen receptor beta
LigandBDBM20585
Substrate/Competitorn/a
Meas. Tech.ChEMBL_307274 (CHEMBL831659)
IC50 165.96±n/a nM
Citation Mukherjee, SSaha, ARoy, K QSAR of estrogen receptor modulators: exploring selectivity requirements for ER(alpha) versus ER(beta) binding of tetrahydroisoquinoline derivatives using E-state and physicochemical parameters. Bioorg Med Chem Lett15:957-61 (2005) 
 
Estrogen receptor beta
Name:Estrogen receptor beta
Type:Protein
Mol. Mass.:59238.43
Organism:Homo sapiens (Human)
Description:Q92731
Residue:530
BDBM20585
NameBDBM20585
Synonyms:2-phenyl-1-{4-[2-(pyrrolidin-1-yl)ethoxy]phenyl}-1,2,3,4-tetrahydroisoquinolin-6-ol tetrahydroisoquinoline derivative, 17a
TypeSmall organic molecule
Emp. Form.C27H30N2O2
Mol. Mass.414.5393
SMILESOc1ccc2C(N(CCc2c1)c1ccccc1)c1ccc(OCCN2CCCC2)cc1