Reaction Details
TargetSodium-dependent dopamine transporter
LigandBDBM50175151
Substrate/Competitorn/a
Meas. Tech.ChEMBL_307366 (CHEMBL835264)
Ki 5.01±n/a nM
Citation Hansch, CVerma, RPKurup, AMekapati, SB The role of QSAR in dopamine interactions. Bioorg Med Chem Lett15:2149-57 (2005) 
 
Sodium-dependent dopamine transporter
Name:Sodium-dependent dopamine transporter
Type:Multi-pass membrane protein
Mol. Mass.:68497.11
Organism:Homo sapiens (Human)
Description:Q01959
Residue:620
BDBM50175151
NameBDBM50175151
Synonyms:3-(3-(bis(4-fluorophenyl)methoxy)-8-aza-bicyclo[3.2.1]octan-8-yl)-N-phenylpropanamide CHEMBL199004
TypeSmall organic molecule
Emp. Form.C29H30F2N2O2
Mol. Mass.476.5575
SMILESFc1ccc(cc1)C(OC1CC2CCC(C1)N2CCC(=O)Nc1ccccc1)c1ccc(F)cc1