Reaction Details
Target5-hydroxytryptamine receptor 1B
LigandBDBM50410424
Substrate/Competitorn/a
Meas. Tech.ChEMBL_321088 (CHEMBL883691)
Ki 0.251±n/a nM
Citation Heightman, TDGaster, LMPardoe, SLPilleux, JPHadley, MSMiddlemiss, DNPrice, GWRoberts, CScott, CMWatson, JMGordon, LJHolland, VAPowles, JRiley, GJStean, TOTrail, BKUpton, NAustin, NEAyrton, ADColeman, TCutler, L 8-Piperazinyl-2,3-dihydropyrrolo[3,2-g]isoquinolines: potent, selective, orally bioavailable 5-HT1 receptor ligands. Bioorg Med Chem Lett15:4370-4 (2005) 
 
5-hydroxytryptamine receptor 1B
Name:5-hydroxytryptamine receptor 1B
Type:G Protein-Coupled Receptor (GPCR)
Mol. Mass.:43579.17
Organism:Homo sapiens (Human)
Description:Receptor binding assays were performed using human clone stably expressed in CHO cells
Residue:390
BDBM50410424
NameBDBM50410424
Synonyms:CHEMBL199088
TypeSmall organic molecule
Emp. Form.C23H22F3N5O
Mol. Mass.441.4489
SMILESCN1CCN(CC1)c1nccc2cc3CCN(C(=O)c4ccc(nc4)C(F)(F)F)c3cc12