Reaction Details
Target5-hydroxytryptamine receptor 1A
LigandBDBM50410438
Substrate/Competitorn/a
Meas. Tech.ChEMBL_321087 (CHEMBL883690)
Ki 6.31±n/a nM
Citation Heightman, TDGaster, LMPardoe, SLPilleux, JPHadley, MSMiddlemiss, DNPrice, GWRoberts, CScott, CMWatson, JMGordon, LJHolland, VAPowles, JRiley, GJStean, TOTrail, BKUpton, NAustin, NEAyrton, ADColeman, TCutler, L 8-Piperazinyl-2,3-dihydropyrrolo[3,2-g]isoquinolines: potent, selective, orally bioavailable 5-HT1 receptor ligands. Bioorg Med Chem Lett15:4370-4 (2005) 
 
5-hydroxytryptamine receptor 1A
Name:5-hydroxytryptamine receptor 1A
Type:n/a
Mol. Mass.:46122.49
Organism:Homo sapiens (Human)
Description:n/a
Residue:422
BDBM50410438
NameBDBM50410438
Synonyms:CHEMBL196140
TypeSmall organic molecule
Emp. Form.C22H23F3N6O
Mol. Mass.444.4528
SMILESCN1CCN(CC1)c1nccc2cc3CCN(C(=O)c4cnn(C)c4C(F)(F)F)c3cc12