Reaction Details
Target5-hydroxytryptamine receptor 1B
LigandBDBM50410436
Substrate/Competitorn/a
Meas. Tech.ChEMBL_321088 (CHEMBL883691)
Ki 2±n/a nM
Citation Heightman, TDGaster, LMPardoe, SLPilleux, JPHadley, MSMiddlemiss, DNPrice, GWRoberts, CScott, CMWatson, JMGordon, LJHolland, VAPowles, JRiley, GJStean, TOTrail, BKUpton, NAustin, NEAyrton, ADColeman, TCutler, L 8-Piperazinyl-2,3-dihydropyrrolo[3,2-g]isoquinolines: potent, selective, orally bioavailable 5-HT1 receptor ligands. Bioorg Med Chem Lett15:4370-4 (2005) 
 
5-hydroxytryptamine receptor 1B
Name:5-hydroxytryptamine receptor 1B
Type:G Protein-Coupled Receptor (GPCR)
Mol. Mass.:43579.17
Organism:Homo sapiens (Human)
Description:Receptor binding assays were performed using human clone stably expressed in CHO cells
Residue:390
BDBM50410436
NameBDBM50410436
Synonyms:CHEMBL382078
TypeSmall organic molecule
Emp. Form.C31H31N7O
Mol. Mass.517.6241
SMILESCCc1c(cnn1-c1ccc(cc1)C#N)C(=O)N1CCc2cc3ccnc(N4CCN5CCC[C@H]5C4)c3cc12