Reaction Details
TargetAndrogen receptor
LigandBDBM19214
Substrate/Competitorn/a
Meas. Tech.ChEMBL_321687 (CHEMBL872182)
IC50>42657.95±n/a nM
Citation Lill, MAWiniger, FVedani, AErnst, B Impact of induced fit on ligand binding to the androgen receptor: a multidimensional QSAR study to predict endocrine-disrupting effects of environmental chemicals. J Med Chem48:5666-74 (2005) 
 
Androgen receptor
Name:Androgen receptor
Type:Enzyme
Mol. Mass.:98219.08
Organism:Rattus norvegicus (Rat)
Description:P15207
Residue:902
BDBM19214
NameBDBM19214
Synonyms:(1S,2R,10S,11S,14S,15R,17S)-17-hydroxy-14-(2-hydroxyacetyl)-2-methyl-5-oxotetracyclo[8.7.0.0^{2,7}.0^{11,15}]heptadec-6-ene-15-carbaldehyde US10188667, Aldosterone | [3H]Aldosterone
TypeSteroid
Emp. Form.C21H28O5
Mol. Mass.360.444
SMILES[H][C@@]12CC[C@H](C(=O)CO)[C@]1(C[C@H](O)[C@@]1([H])[C@@]2([H])CCC2=CC(=O)CC[C@]12C)C=O